Reaction Details
TargetOxysterols receptor LXR-beta
LigandBDBM115006
Substrate/Competitorn/a
Meas. Tech.Counterscreen for agonists of the daf-12 abnormal Dauer Formation: Luminescence-based cell-based dose response screening assay to identify agonists of the Liver-X-Receptor (LXR)
EC50 67588±n/a nM
Citation PubChem, PC Counterscreen for agonists of the daf-12 abnormal Dauer Formation: Luminescence-based cell-based dose response screening assay to identify agonists of the Liver-X-Receptor (LXR) PubChem Bioassay(2013)[AID]
 
Oxysterols receptor LXR-beta
Name:Oxysterols receptor LXR-beta
Type:Enzyme Catalytic Domain
Mol. Mass.:50978.79
Organism:Homo sapiens (Human)
Description:P55055
Residue:460
BDBM115006
NameBDBM115006
Synonyms:4,5-dimethyl-N'-(3-thienylmethylene)-3-thiophenecarbohydrazide 4,5-dimethyl-N-[(E)-3-thiophenylmethylideneamino]-3-thiophenecarboxamide MLS000699345 cid_6875163
TypeSmall organic molecule
Emp. Form.C12H12N2OS2
Mol. Mass.264.366
SMILESCc1scc(C(=O)N\N=C\c2ccsc2)c1C