Reaction Details
TargetOxysterols receptor LXR-beta
LigandBDBM72483
Substrate/Competitorn/a
Meas. Tech.Counterscreen for agonists of the daf-12 abnormal Dauer Formation: Luminescence-based cell-based dose response screening assay to identify agonists of the Liver-X-Receptor (LXR)
EC50 67608±n/a nM
Citation PubChem, PC Counterscreen for agonists of the daf-12 abnormal Dauer Formation: Luminescence-based cell-based dose response screening assay to identify agonists of the Liver-X-Receptor (LXR) PubChem Bioassay(2013)[AID]
 
Oxysterols receptor LXR-beta
Name:Oxysterols receptor LXR-beta
Type:Enzyme Catalytic Domain
Mol. Mass.:50978.79
Organism:Homo sapiens (Human)
Description:P55055
Residue:460
BDBM72483
NameBDBM72483
Synonyms:2-[1-(2-methylpropyl)-4-[(5-methyl-2-thiophenyl)methyl]-2-piperazinyl]ethanol 2-[1-isobutyl-4-[(5-methyl-2-thienyl)methyl]piperazin-2-yl]ethanol MLS000734180 cid_16191481
TypeSmall organic molecule
Emp. Form.C16H28N2OS
Mol. Mass.296.471
SMILESCC(C)CN1CCN(Cc2ccc(C)s2)CC1CCO