Reaction Details
TargetOxysterols receptor LXR-beta
LigandBDBM115017
Substrate/Competitorn/a
Meas. Tech.Counterscreen for agonists of the daf-12 abnormal Dauer Formation: Luminescence-based cell-based dose response screening assay to identify agonists of the Liver-X-Receptor (LXR)
EC50 67554±n/a nM
Citation PubChem, PC Counterscreen for agonists of the daf-12 abnormal Dauer Formation: Luminescence-based cell-based dose response screening assay to identify agonists of the Liver-X-Receptor (LXR) PubChem Bioassay(2013)[AID]
 
Oxysterols receptor LXR-beta
Name:Oxysterols receptor LXR-beta
Type:Enzyme Catalytic Domain
Mol. Mass.:50978.79
Organism:Homo sapiens (Human)
Description:P55055
Residue:460
BDBM115017
NameBDBM115017
Synonyms:5-(2-thienyl)-1H-pyrazole-3-carboxylic acid MLS000716528 cid_818268
TypeSmall organic molecule
Emp. Form.C8H6N2O2S
Mol. Mass.194.21
SMILESOC(=O)c1cc(n[nH]1)-c1cccs1