Reaction Details
TargetOxysterols receptor LXR-beta
LigandBDBM69226
Substrate/Competitorn/a
Meas. Tech.Counterscreen for agonists of the daf-12 abnormal Dauer Formation: Luminescence-based cell-based dose response screening assay to identify agonists of the Liver-X-Receptor (LXR)
EC50 67588±n/a nM
Citation PubChem, PC Counterscreen for agonists of the daf-12 abnormal Dauer Formation: Luminescence-based cell-based dose response screening assay to identify agonists of the Liver-X-Receptor (LXR) PubChem Bioassay(2013)[AID]
 
Oxysterols receptor LXR-beta
Name:Oxysterols receptor LXR-beta
Type:Enzyme Catalytic Domain
Mol. Mass.:50978.79
Organism:Homo sapiens (Human)
Description:P55055
Residue:460
BDBM69226
NameBDBM69226
Synonyms:MLS000766036 N,N'-bis(2-pyridyl)oxamide N,N'-dipyridin-2-yloxamide cid_1927420
TypeSmall organic molecule
Emp. Form.C12H10N4O2
Mol. Mass.242.2334
SMILESO=C(Nc1ccccn1)C(=O)Nc1ccccn1