Reaction Details
TargetOxysterols receptor LXR-beta
LigandBDBM115021
Substrate/Competitorn/a
Meas. Tech.Counterscreen for agonists of the daf-12 abnormal Dauer Formation: Luminescence-based cell-based dose response screening assay to identify agonists of the Liver-X-Receptor (LXR)
EC50 67595±n/a nM
Citation PubChem, PC Counterscreen for agonists of the daf-12 abnormal Dauer Formation: Luminescence-based cell-based dose response screening assay to identify agonists of the Liver-X-Receptor (LXR) PubChem Bioassay(2013)[AID]
 
Oxysterols receptor LXR-beta
Name:Oxysterols receptor LXR-beta
Type:Enzyme Catalytic Domain
Mol. Mass.:50978.79
Organism:Homo sapiens (Human)
Description:P55055
Residue:460
BDBM115021
NameBDBM115021
Synonyms:(5Z)-1,3-dimethyl-5-[(2Z)-2-(3-methyl-1,3-thiazolidin-2-ylidene)ethylidene]-2-sulfanylidene-imidazolidin-4-one (5Z)-1,3-dimethyl-5-[(2Z)-2-(3-methyl-2-thiazolidinylidene)ethylidene]-2-sulfanylidene-4-imidazolidinone 1,3-Dimethyl-5-[2-(3-methyl-thiazolidin-2-ylidene)-ethylidene]-2-thioxo-imidazol SMR000305689 | cid_5568081
TypeSmall organic molecule
Emp. Form.C11H15N3OS2
Mol. Mass.269.386
SMILESCN1CCS\C1=C/C=C1\N(C)C(=S)N(C)C1=O