Reaction Details
TargetOxysterols receptor LXR-beta
LigandBDBM115025
Substrate/Competitorn/a
Meas. Tech.Counterscreen for agonists of the daf-12 abnormal Dauer Formation: Luminescence-based cell-based dose response screening assay to identify agonists of the Liver-X-Receptor (LXR)
EC50 67595±n/a nM
Citation PubChem, PC Counterscreen for agonists of the daf-12 abnormal Dauer Formation: Luminescence-based cell-based dose response screening assay to identify agonists of the Liver-X-Receptor (LXR) PubChem Bioassay(2013)[AID]
 
Oxysterols receptor LXR-beta
Name:Oxysterols receptor LXR-beta
Type:Enzyme Catalytic Domain
Mol. Mass.:50978.79
Organism:Homo sapiens (Human)
Description:P55055
Residue:460
BDBM115025
NameBDBM115025
Synonyms:(E)-1-(3-chloranylthiophen-2-yl)-3-(dimethylamino)but-2-en-1-one (E)-1-(3-chloro-2-thienyl)-3-(dimethylamino)but-2-en-1-one (E)-1-(3-chlorothiophen-2-yl)-3-(dimethylamino)but-2-en-1-one SMR000336368 | cid_5525417
TypeSmall organic molecule
Emp. Form.C10H12ClNOS
Mol. Mass.229.726
SMILESCN(C)C(C)=CC(=O)c1sccc1Cl