Reaction Details
TargetOxysterols receptor LXR-beta
LigandBDBM115026
Substrate/Competitorn/a
Meas. Tech.Counterscreen for agonists of the daf-12 abnormal Dauer Formation: Luminescence-based cell-based dose response screening assay to identify agonists of the Liver-X-Receptor (LXR)
EC50 67490±n/a nM
Citation PubChem, PC Counterscreen for agonists of the daf-12 abnormal Dauer Formation: Luminescence-based cell-based dose response screening assay to identify agonists of the Liver-X-Receptor (LXR) PubChem Bioassay(2013)[AID]
 
Oxysterols receptor LXR-beta
Name:Oxysterols receptor LXR-beta
Type:Enzyme Catalytic Domain
Mol. Mass.:50978.79
Organism:Homo sapiens (Human)
Description:P55055
Residue:460
BDBM115026
NameBDBM115026
Synonyms:(3E)-1-(4-chlorophenyl)-3-(dimethylaminomethylene)thiourea MLS000694855 SMR000333173 | cid_9581725
TypeSmall organic molecule
Emp. Form.C10H12ClN3S
Mol. Mass.241.74
SMILESCN(C)C=NC(=S)Nc1ccc(Cl)cc1