Reaction Details
TargetOxysterols receptor LXR-beta
LigandBDBM115031
Substrate/Competitorn/a
Meas. Tech.Counterscreen for agonists of the daf-12 abnormal Dauer Formation: Luminescence-based cell-based dose response screening assay to identify agonists of the Liver-X-Receptor (LXR)
EC50 67536±n/a nM
Citation PubChem, PC Counterscreen for agonists of the daf-12 abnormal Dauer Formation: Luminescence-based cell-based dose response screening assay to identify agonists of the Liver-X-Receptor (LXR) PubChem Bioassay(2013)[AID]
 
Oxysterols receptor LXR-beta
Name:Oxysterols receptor LXR-beta
Type:Enzyme Catalytic Domain
Mol. Mass.:50978.79
Organism:Homo sapiens (Human)
Description:P55055
Residue:460
BDBM115031
NameBDBM115031
Synonyms:3-(4-bromobenzyl)oxy-6-methyl-2-nitro-pyridine 3-[(4-bromophenyl)methoxy]-6-methyl-2-nitropyridine SMR000343244 | cid_3462706
TypeSmall organic molecule
Emp. Form.C13H11BrN2O3
Mol. Mass.323.142
SMILESCc1ccc(OCc2ccc(Br)cc2)c(n1)[N+]([O-])=O