Reaction Details
TargetOxysterols receptor LXR-beta
LigandBDBM49951
Substrate/Competitorn/a
Meas. Tech.Counterscreen for agonists of the daf-12 abnormal Dauer Formation: Luminescence-based cell-based dose response screening assay to identify agonists of the Liver-X-Receptor (LXR)
EC50 67547±n/a nM
Citation PubChem, PC Counterscreen for agonists of the daf-12 abnormal Dauer Formation: Luminescence-based cell-based dose response screening assay to identify agonists of the Liver-X-Receptor (LXR) PubChem Bioassay(2013)[AID]
 
Oxysterols receptor LXR-beta
Name:Oxysterols receptor LXR-beta
Type:Enzyme Catalytic Domain
Mol. Mass.:50978.79
Organism:Homo sapiens (Human)
Description:P55055
Residue:460
BDBM49951
NameBDBM49951
Synonyms:MLS001010697 N-[2-[(5Z)-5-[(4-methoxyphenyl)methylidene]-2,4-bis(oxidanylidene)-1,3-thiazolidin-3-yl]ethyl]bicyclo[2.2.1]hept-2-ene-5-carboxamide N-[2-[(5Z)-5-[(4-methoxyphenyl)methylidene]-2,4-dioxo-3-thiazolidinyl]ethyl]-5-bicyclo[2.2.1]hept-2-enecarboxamide cid_5969645
TypeSmall organic molecule
Emp. Form.C21H22N2O4S
Mol. Mass.398.475
SMILES[H]C12CC(C(=O)NCCN3C(=O)S\C(=C/c4ccc(OC)cc4)C3=O)C([H])(C1)C=C2