Reaction Details
TargetOxysterols receptor LXR-beta
LigandBDBM115034
Substrate/Competitorn/a
Meas. Tech.Counterscreen for agonists of the daf-12 abnormal Dauer Formation: Luminescence-based cell-based dose response screening assay to identify agonists of the Liver-X-Receptor (LXR)
EC50 67511±n/a nM
Citation PubChem, PC Counterscreen for agonists of the daf-12 abnormal Dauer Formation: Luminescence-based cell-based dose response screening assay to identify agonists of the Liver-X-Receptor (LXR) PubChem Bioassay(2013)[AID]
 
Oxysterols receptor LXR-beta
Name:Oxysterols receptor LXR-beta
Type:Enzyme Catalytic Domain
Mol. Mass.:50978.79
Organism:Homo sapiens (Human)
Description:P55055
Residue:460
BDBM115034
NameBDBM115034
Synonyms:1-[1-(2-furanylmethyl)-2,5-dimethyl-3-pyrrolyl]-2-(2-pyrimidinylthio)ethanone 1-[1-(furan-2-ylmethyl)-2,5-dimethyl-pyrrol-3-yl]-2-pyrimidin-2-ylsulfanyl-ethanone MLS000770557 cid_2083029
TypeSmall organic molecule
Emp. Form.C17H17N3O2S
Mol. Mass.327.401
SMILESCc1cc(C(=O)CSc2ncccn2)c(C)n1Cc1ccco1