Reaction Details
TargetOxysterols receptor LXR-beta
LigandBDBM115045
Substrate/Competitorn/a
Meas. Tech.Counterscreen for agonists of the daf-12 abnormal Dauer Formation: Luminescence-based cell-based dose response screening assay to identify agonists of the Liver-X-Receptor (LXR)
EC50 67588±n/a nM
Citation PubChem, PC Counterscreen for agonists of the daf-12 abnormal Dauer Formation: Luminescence-based cell-based dose response screening assay to identify agonists of the Liver-X-Receptor (LXR) PubChem Bioassay(2013)[AID]
 
Oxysterols receptor LXR-beta
Name:Oxysterols receptor LXR-beta
Type:Enzyme Catalytic Domain
Mol. Mass.:50978.79
Organism:Homo sapiens (Human)
Description:P55055
Residue:460
BDBM115045
NameBDBM115045
Synonyms:5-bromanyl-N-[4-(2-methyl-1,3-thiazol-4-yl)phenyl]furan-2-carboxamide 5-bromo-N-[4-(2-methyl-1,3-thiazol-4-yl)phenyl]furan-2-carboxamide 5-bromo-N-[4-(2-methylthiazol-4-yl)phenyl]-2-furamide SMR000477842 | cid_983644
TypeSmall organic molecule
Emp. Form.C15H11BrN2O2S
Mol. Mass.363.229
SMILESCc1nc(cs1)-c1ccc(NC(=O)c2ccc(Br)o2)cc1