Reaction Details
TargetOxysterols receptor LXR-beta
LigandBDBM115050
Substrate/Competitorn/a
Meas. Tech.Counterscreen for agonists of the daf-12 abnormal Dauer Formation: Luminescence-based cell-based dose response screening assay to identify agonists of the Liver-X-Receptor (LXR)
EC50 67526±n/a nM
Citation PubChem, PC Counterscreen for agonists of the daf-12 abnormal Dauer Formation: Luminescence-based cell-based dose response screening assay to identify agonists of the Liver-X-Receptor (LXR) PubChem Bioassay(2013)[AID]
 
Oxysterols receptor LXR-beta
Name:Oxysterols receptor LXR-beta
Type:Enzyme Catalytic Domain
Mol. Mass.:50978.79
Organism:Homo sapiens (Human)
Description:P55055
Residue:460
BDBM115050
NameBDBM115050
Synonyms:2-({2-[(4-methylphenyl)thio]ethyl}thio)pyrimidine 2-[2-(p-tolylthio)ethylthio]pyrimidine MLS001000858 cid_2948897
TypeSmall organic molecule
Emp. Form.C13H14N2S2
Mol. Mass.262.394
SMILESCc1ccc(SCCSc2ncccn2)cc1