Reaction Details
TargetOxysterols receptor LXR-beta
LigandBDBM115054
Substrate/Competitorn/a
Meas. Tech.Counterscreen for agonists of the daf-12 abnormal Dauer Formation: Luminescence-based cell-based dose response screening assay to identify agonists of the Liver-X-Receptor (LXR)
EC50 67561±n/a nM
Citation PubChem, PC Counterscreen for agonists of the daf-12 abnormal Dauer Formation: Luminescence-based cell-based dose response screening assay to identify agonists of the Liver-X-Receptor (LXR) PubChem Bioassay(2013)[AID]
 
Oxysterols receptor LXR-beta
Name:Oxysterols receptor LXR-beta
Type:Enzyme Catalytic Domain
Mol. Mass.:50978.79
Organism:Homo sapiens (Human)
Description:P55055
Residue:460
BDBM115054
NameBDBM115054
Synonyms:4-Amino-N-(2-amino-phenyl)-benzamide MLS001209873 SMR000504768 | cid_42725
TypeSmall organic molecule
Emp. Form.C13H13N3O
Mol. Mass.227.2618
SMILESNc1ccc(cc1)C(=O)Nc1ccccc1N