Reaction Details
TargetOxysterols receptor LXR-beta
LigandBDBM115057
Substrate/Competitorn/a
Meas. Tech.Counterscreen for agonists of the daf-12 abnormal Dauer Formation: Luminescence-based cell-based dose response screening assay to identify agonists of the Liver-X-Receptor (LXR)
EC50 67537±n/a nM
Citation PubChem, PC Counterscreen for agonists of the daf-12 abnormal Dauer Formation: Luminescence-based cell-based dose response screening assay to identify agonists of the Liver-X-Receptor (LXR) PubChem Bioassay(2013)[AID]
 
Oxysterols receptor LXR-beta
Name:Oxysterols receptor LXR-beta
Type:Enzyme Catalytic Domain
Mol. Mass.:50978.79
Organism:Homo sapiens (Human)
Description:P55055
Residue:460
BDBM115057
NameBDBM115057
Synonyms:1-hydroxy-4-oxido-3-p-phenetyl-quinoxalin-4-ium-2-one 3-(4-ethoxyphenyl)-1-hydroxy-4-oxidoquinoxalin-4-ium-2-one MLS001164235 cid_948254
TypeSmall organic molecule
Emp. Form.C16H14N2O4
Mol. Mass.298.2934
SMILESCCOc1ccc(cc1)-c1[n+]([O-])c2ccccc2n(O)c1=O