Reaction Details
TargetOxysterols receptor LXR-beta
LigandBDBM96015
Substrate/Competitorn/a
Meas. Tech.Counterscreen for agonists of the daf-12 abnormal Dauer Formation: Luminescence-based cell-based dose response screening assay to identify agonists of the Liver-X-Receptor (LXR)
EC50 67517±n/a nM
Citation PubChem, PC Counterscreen for agonists of the daf-12 abnormal Dauer Formation: Luminescence-based cell-based dose response screening assay to identify agonists of the Liver-X-Receptor (LXR) PubChem Bioassay(2013)[AID]
 
Oxysterols receptor LXR-beta
Name:Oxysterols receptor LXR-beta
Type:Enzyme Catalytic Domain
Mol. Mass.:50978.79
Organism:Homo sapiens (Human)
Description:P55055
Residue:460
BDBM96015
NameBDBM96015
Synonyms:3-(4-fluorophenyl)-6-(2-thienyl)pyrazolo[1,5-a]pyrimidin-7-amine 3-(4-fluorophenyl)-6-thiophen-2-yl-pyrazolo[1,5-a]pyrimidin-7-amine MLS001165963 [3-(4-fluorophenyl)-6-(2-thienyl)pyrazolo[1,5-a]pyrimidin-7-yl]amine | cid_1474449
TypeSmall organic molecule
Emp. Form.C16H11FN4S
Mol. Mass.310.349
SMILESNc1c(cnc2c(cnn12)-c1ccc(F)cc1)-c1cccs1