Reaction Details
TargetOxysterols receptor LXR-beta
LigandBDBM115060
Substrate/Competitorn/a
Meas. Tech.Counterscreen for agonists of the daf-12 abnormal Dauer Formation: Luminescence-based cell-based dose response screening assay to identify agonists of the Liver-X-Receptor (LXR)
EC50 67529±n/a nM
Citation PubChem, PC Counterscreen for agonists of the daf-12 abnormal Dauer Formation: Luminescence-based cell-based dose response screening assay to identify agonists of the Liver-X-Receptor (LXR) PubChem Bioassay(2013)[AID]
 
Oxysterols receptor LXR-beta
Name:Oxysterols receptor LXR-beta
Type:Enzyme Catalytic Domain
Mol. Mass.:50978.79
Organism:Homo sapiens (Human)
Description:P55055
Residue:460
BDBM115060
NameBDBM115060
Synonyms:4-(3-aminophenyl)-N-(4-methoxyphenyl)-2-pyrimidinamine MLS001199466 [4-(3-aminophenyl)pyrimidin-2-yl]-(4-methoxyphenyl)amine | cid_20855152
TypeSmall organic molecule
Emp. Form.C17H16N4O
Mol. Mass.292.3351
SMILESCOc1ccc(Nc2nccc(n2)-c2cccc(N)c2)cc1