Reaction Details
TargetOxysterols receptor LXR-beta
LigandBDBM114933
Substrate/Competitorn/a
Meas. Tech.Counterscreen for agonists of the daf-12 abnormal Dauer Formation: Luminescence-based cell-based dose response screening assay to identify agonists of the Liver-X-Receptor (LXR)
EC50 67541±n/a nM
Citation PubChem, PC Counterscreen for agonists of the daf-12 abnormal Dauer Formation: Luminescence-based cell-based dose response screening assay to identify agonists of the Liver-X-Receptor (LXR) PubChem Bioassay(2013)[AID]
 
Oxysterols receptor LXR-beta
Name:Oxysterols receptor LXR-beta
Type:Enzyme Catalytic Domain
Mol. Mass.:50978.79
Organism:Homo sapiens (Human)
Description:P55055
Residue:460
BDBM114933
NameBDBM114933
Synonyms:(6Z)-6-[5-(4-chlorophenyl)-1,2-dihydropyrazol-3-ylidene]-1-cyclohexa-2,4-dienone (6Z)-6-[5-(4-chlorophenyl)-3-pyrazolin-3-ylidene]cyclohexa-2,4-dien-1-one SMR000567869 | cid_5333851
TypeSmall organic molecule
Emp. Form.C15H11ClN2O
Mol. Mass.270.714
SMILESOc1ccccc1-c1cc([nH]n1)-c1ccc(Cl)cc1