Reaction Details
TargetOxysterols receptor LXR-beta
LigandBDBM115061
Substrate/Competitorn/a
Meas. Tech.Counterscreen for agonists of the daf-12 abnormal Dauer Formation: Luminescence-based cell-based dose response screening assay to identify agonists of the Liver-X-Receptor (LXR)
EC50 67588±n/a nM
Citation PubChem, PC Counterscreen for agonists of the daf-12 abnormal Dauer Formation: Luminescence-based cell-based dose response screening assay to identify agonists of the Liver-X-Receptor (LXR) PubChem Bioassay(2013)[AID]
 
Oxysterols receptor LXR-beta
Name:Oxysterols receptor LXR-beta
Type:Enzyme Catalytic Domain
Mol. Mass.:50978.79
Organism:Homo sapiens (Human)
Description:P55055
Residue:460
BDBM115061
NameBDBM115061
Synonyms:2-(2,3-dihydro-1H-inden-5-yloxy)-N-(5-methyl-1,3-thiazol-2-yl)acetamide 2-(2,3-dihydro-1H-inden-5-yloxy)-N-(5-methyl-2-thiazolyl)acetamide MLS001071928 cid_2678142
TypeSmall organic molecule
Emp. Form.C15H16N2O2S
Mol. Mass.288.365
SMILESCc1cnc(NC(=O)COc2ccc3CCCc3c2)s1