Reaction Details
TargetOxysterols receptor LXR-beta
LigandBDBM115063
Substrate/Competitorn/a
Meas. Tech.Counterscreen for agonists of the daf-12 abnormal Dauer Formation: Luminescence-based cell-based dose response screening assay to identify agonists of the Liver-X-Receptor (LXR)
EC50 67541±n/a nM
Citation PubChem, PC Counterscreen for agonists of the daf-12 abnormal Dauer Formation: Luminescence-based cell-based dose response screening assay to identify agonists of the Liver-X-Receptor (LXR) PubChem Bioassay(2013)[AID]
 
Oxysterols receptor LXR-beta
Name:Oxysterols receptor LXR-beta
Type:Enzyme Catalytic Domain
Mol. Mass.:50978.79
Organism:Homo sapiens (Human)
Description:P55055
Residue:460
BDBM115063
NameBDBM115063
Synonyms:3-(2-fluorophenyl)-N-(2-oxolanylmethyl)-5-isoxazolecarboxamide 3-(2-fluorophenyl)-N-(tetrahydrofurfuryl)isoxazole-5-carboxamide SMR000627165 | cid_17096079
TypeSmall organic molecule
Emp. Form.C15H15FN2O3
Mol. Mass.290.2896
SMILESFc1ccccc1-c1cc(on1)C(=O)NCC1CCCO1