Reaction Details
TargetOxysterols receptor LXR-beta
LigandBDBM115068
Substrate/Competitorn/a
Meas. Tech.Counterscreen for agonists of the daf-12 abnormal Dauer Formation: Luminescence-based cell-based dose response screening assay to identify agonists of the Liver-X-Receptor (LXR)
EC50 67512±n/a nM
Citation PubChem, PC Counterscreen for agonists of the daf-12 abnormal Dauer Formation: Luminescence-based cell-based dose response screening assay to identify agonists of the Liver-X-Receptor (LXR) PubChem Bioassay(2013)[AID]
 
Oxysterols receptor LXR-beta
Name:Oxysterols receptor LXR-beta
Type:Enzyme Catalytic Domain
Mol. Mass.:50978.79
Organism:Homo sapiens (Human)
Description:P55055
Residue:460
BDBM115068
NameBDBM115068
Synonyms:4-ethyl-5-methyl-N-(3-oxidanylpyridin-2-yl)thiophene-2-carboxamide 4-ethyl-N-(3-hydroxy-2-pyridyl)-5-methyl-thiophene-2-carboxamide MLS001141901 cid_24239799
TypeSmall organic molecule
Emp. Form.C13H14N2O2S
Mol. Mass.262.327
SMILESCCc1cc(sc1C)C(=O)Nc1ncccc1O