Reaction Details
TargetOxysterols receptor LXR-beta
LigandBDBM115073
Substrate/Competitorn/a
Meas. Tech.Counterscreen for agonists of the daf-12 abnormal Dauer Formation: Luminescence-based cell-based dose response screening assay to identify agonists of the Liver-X-Receptor (LXR)
EC50 67547±n/a nM
Citation PubChem, PC Counterscreen for agonists of the daf-12 abnormal Dauer Formation: Luminescence-based cell-based dose response screening assay to identify agonists of the Liver-X-Receptor (LXR) PubChem Bioassay(2013)[AID]
 
Oxysterols receptor LXR-beta
Name:Oxysterols receptor LXR-beta
Type:Enzyme Catalytic Domain
Mol. Mass.:50978.79
Organism:Homo sapiens (Human)
Description:P55055
Residue:460
BDBM115073
NameBDBM115073
Synonyms:4-benzoyl-N-(3-hydroxy-2-pyridinyl)benzamide 4-benzoyl-N-(3-hydroxypyridin-2-yl)benzamide N-(3-oxidanylpyridin-2-yl)-4-(phenylcarbonyl)benzamide cid_18109372
TypeSmall organic molecule
Emp. Form.C19H14N2O3
Mol. Mass.318.3261
SMILESOc1cccnc1NC(=O)c1ccc(cc1)C(=O)c1ccccc1