Reaction Details
TargetOxysterols receptor LXR-beta
LigandBDBM115077
Substrate/Competitorn/a
Meas. Tech.Counterscreen for agonists of the daf-12 abnormal Dauer Formation: Luminescence-based cell-based dose response screening assay to identify agonists of the Liver-X-Receptor (LXR)
EC50 67595±n/a nM
Citation PubChem, PC Counterscreen for agonists of the daf-12 abnormal Dauer Formation: Luminescence-based cell-based dose response screening assay to identify agonists of the Liver-X-Receptor (LXR) PubChem Bioassay(2013)[AID]
 
Oxysterols receptor LXR-beta
Name:Oxysterols receptor LXR-beta
Type:Enzyme Catalytic Domain
Mol. Mass.:50978.79
Organism:Homo sapiens (Human)
Description:P55055
Residue:460
BDBM115077
NameBDBM115077
Synonyms:1-methyl-N-(4-methylcyclohexyl)-2-pyrrolecarboxamide MLS002180256 cid_25161651
TypeSmall organic molecule
Emp. Form.C13H20N2O
Mol. Mass.220.3107
SMILESCC1CCC(CC1)NC(=O)c1cccn1C