Reaction Details
TargetOxysterols receptor LXR-beta
LigandBDBM115078
Substrate/Competitorn/a
Meas. Tech.Counterscreen for agonists of the daf-12 abnormal Dauer Formation: Luminescence-based cell-based dose response screening assay to identify agonists of the Liver-X-Receptor (LXR)
EC50 67568±n/a nM
Citation PubChem, PC Counterscreen for agonists of the daf-12 abnormal Dauer Formation: Luminescence-based cell-based dose response screening assay to identify agonists of the Liver-X-Receptor (LXR) PubChem Bioassay(2013)[AID]
 
Oxysterols receptor LXR-beta
Name:Oxysterols receptor LXR-beta
Type:Enzyme Catalytic Domain
Mol. Mass.:50978.79
Organism:Homo sapiens (Human)
Description:P55055
Residue:460
BDBM115078
NameBDBM115078
Synonyms:1,3-benzoxazol-2-yl-(2-chlorophenyl)amine N-(2-chlorophenyl)-1,3-benzoxazol-2-amine cid_714839
TypeSmall organic molecule
Emp. Form.C13H9ClN2O
Mol. Mass.244.676
SMILESClc1ccccc1Nc1nc2ccccc2o1