Reaction Details
TargetOxysterols receptor LXR-beta
LigandBDBM49089
Substrate/Competitorn/a
Meas. Tech.Counterscreen for agonists of the daf-12 abnormal Dauer Formation: Luminescence-based cell-based dose response screening assay to identify agonists of the Liver-X-Receptor (LXR)
EC50 67547±n/a nM
Citation PubChem, PC Counterscreen for agonists of the daf-12 abnormal Dauer Formation: Luminescence-based cell-based dose response screening assay to identify agonists of the Liver-X-Receptor (LXR) PubChem Bioassay(2013)[AID]
 
Oxysterols receptor LXR-beta
Name:Oxysterols receptor LXR-beta
Type:Enzyme Catalytic Domain
Mol. Mass.:50978.79
Organism:Homo sapiens (Human)
Description:P55055
Residue:460
BDBM49089
NameBDBM49089
Synonyms:2-(2-furoylimino)-5-keto-1-propyl-dipyrido[1,2-d:3',4'-f]pyrimidine-3-carboxylic acid ethyl ester MLS000052096 cid_1251509 ethyl 2-(furan-2-carbonylimino)-5-oxo-1-propyldipyrido[1,2-d:3',4'-f]pyrimidine-3-carboxylate | ethyl 2-(furan-2-ylcarbonylimino)-5-oxidanylidene-1-propyl-dipyrido[1,2-d:3',4'-f]pyrimidine-3-carboxylate
TypeSmall organic molecule
Emp. Form.C22H20N4O5
Mol. Mass.420.418
SMILESCCCn1c2nc3ccccn3c(=O)c2cc(C(=O)OCC)\c1=N/C(=O)c1ccco1