Reaction Details
TargetOxysterols receptor LXR-beta
LigandBDBM115098
Substrate/Competitorn/a
Meas. Tech.Counterscreen for agonists of the daf-12 abnormal Dauer Formation: Luminescence-based cell-based dose response screening assay to identify agonists of the Liver-X-Receptor (LXR)
EC50 67615±n/a nM
Citation PubChem, PC Counterscreen for agonists of the daf-12 abnormal Dauer Formation: Luminescence-based cell-based dose response screening assay to identify agonists of the Liver-X-Receptor (LXR) PubChem Bioassay(2013)[AID]
 
Oxysterols receptor LXR-beta
Name:Oxysterols receptor LXR-beta
Type:Enzyme Catalytic Domain
Mol. Mass.:50978.79
Organism:Homo sapiens (Human)
Description:P55055
Residue:460
BDBM115098
NameBDBM115098
Synonyms:2-(1-ethylsulfanyl-2-methyl-propan-2-yl)-1H-indazol-3-one 2-[1-(ethylthio)-2-methylpropan-2-yl]-1H-indazol-3-one MLS003151649 cid_46904954
TypeSmall organic molecule
Emp. Form.C13H18N2OS
Mol. Mass.250.36
SMILESCCSCC(C)(C)n1[nH]c2ccccc2c1=O