Reaction Details
TargetOxysterols receptor LXR-beta
LigandBDBM68333
Substrate/Competitorn/a
Meas. Tech.Counterscreen for agonists of the daf-12 abnormal Dauer Formation: Luminescence-based cell-based dose response screening assay to identify agonists of the Liver-X-Receptor (LXR)
EC50 67568±n/a nM
Citation PubChem, PC Counterscreen for agonists of the daf-12 abnormal Dauer Formation: Luminescence-based cell-based dose response screening assay to identify agonists of the Liver-X-Receptor (LXR) PubChem Bioassay(2013)[AID]
 
Oxysterols receptor LXR-beta
Name:Oxysterols receptor LXR-beta
Type:Enzyme Catalytic Domain
Mol. Mass.:50978.79
Organism:Homo sapiens (Human)
Description:P55055
Residue:460
BDBM68333
NameBDBM68333
Synonyms:5-methyl-3-phenyl-7-(4-pyridyl)pyrazolo[1,5-a]pyrimidine 5-methyl-3-phenyl-7-pyridin-4-yl-pyrazolo[1,5-a]pyrimidine;2,2,2-tris(fluoranyl)ethanoic acid SR-03000000952-1 | cid_42640810
TypeSmall organic molecule
Emp. Form.C18H14N4
Mol. Mass.286.3306
SMILESCc1cc(-c2ccncc2)n2ncc(-c3ccccc3)c2n1