Reaction Details
TargetOxysterols receptor LXR-beta
LigandBDBM115105
Substrate/Competitorn/a
Meas. Tech.Counterscreen for agonists of the daf-12 abnormal Dauer Formation: Luminescence-based cell-based dose response screening assay to identify agonists of the Liver-X-Receptor (LXR)
EC50 67595±n/a nM
Citation PubChem, PC Counterscreen for agonists of the daf-12 abnormal Dauer Formation: Luminescence-based cell-based dose response screening assay to identify agonists of the Liver-X-Receptor (LXR) PubChem Bioassay(2013)[AID]
 
Oxysterols receptor LXR-beta
Name:Oxysterols receptor LXR-beta
Type:Enzyme Catalytic Domain
Mol. Mass.:50978.79
Organism:Homo sapiens (Human)
Description:P55055
Residue:460
BDBM115105
NameBDBM115105
Synonyms:(3Z)-3-[1-(2-amino-4-chloro-anilino)ethylidene]-6-methyl-pyran-2,4-quinone (3Z)-3-[1-[(2-azanyl-4-chloranyl-phenyl)amino]ethylidene]-6-methyl-pyran-2,4-dione SMR001875158 | cid_5948348
TypeSmall organic molecule
Emp. Form.C14H13ClN2O3
Mol. Mass.292.718
SMILESCC(=Nc1ccc(Cl)cc1N)c1c(O)cc(C)oc1=O