Reaction Details
TargetPC4 and SFRS1-interacting protein
LigandBDBM76207
Substrate/Competitorn/a
Meas. Tech.Counterscreen for inhibitors of LEDGF/p75-dependent integration: TR-FRET-based biochemical high throughput dose response counterscreen assay to identify activators of HIV-1 Integrase multimerization
IC50 3645±n/a nM
Citation PubChem, PC Counterscreen for inhibitors of LEDGF/p75-dependent integration: TR-FRET-based biochemical high throughput dose response counterscreen assay to identify activators of HIV-1 Integrase multimerization PubChem Bioassay(2014)[AID]
 
PC4 and SFRS1-interacting protein
Name:PC4 and SFRS1-interacting protein
Type:Enzyme Catalytic Domain
Mol. Mass.:60120.68
Organism:Homo sapiens (Human)
Description:gi_6708281
Residue:530
BDBM76207
NameBDBM76207
Synonyms:2-(3-Cyano-7-hydroxy-5-oxo-4,5-dihydro-thieno[3,2-b]pyridin-2-ylsulfanyl)-N-thiazol-2-yl-acetamide 2-[(3-cyano-5-hydroxy-7-oxo-4H-thieno[3,2-b]pyridin-2-yl)sulfanyl]-N-(1,3-thiazol-2-yl)acetamide 2-[(3-cyano-5-oxidanyl-7-oxidanylidene-4H-thieno[3,2-b]pyridin-2-yl)sulfanyl]-N-(1,3-thiazol-2-yl)ethanamide MLS001222104 cid_54691675 | cid_6499471
TypeSmall organic molecule
Emp. Form.C13H8N4O3S3
Mol. Mass.364.423
SMILESOc1cc(=O)[nH]c2c(C#N)c(SCC(=O)Nc3nccs3)sc12