Reaction Details
TargetPC4 and SFRS1-interacting protein
LigandBDBM31757
Substrate/Competitorn/a
Meas. Tech.Counterscreen for inhibitors of LEDGF/p75-dependent integration: TR-FRET-based biochemical high throughput dose response counterscreen assay to identify activators of HIV-1 Integrase multimerization
IC50 15472±n/a nM
Citation PubChem, PC Counterscreen for inhibitors of LEDGF/p75-dependent integration: TR-FRET-based biochemical high throughput dose response counterscreen assay to identify activators of HIV-1 Integrase multimerization PubChem Bioassay(2014)[AID]
 
PC4 and SFRS1-interacting protein
Name:PC4 and SFRS1-interacting protein
Type:Enzyme Catalytic Domain
Mol. Mass.:60120.68
Organism:Homo sapiens (Human)
Description:gi_6708281
Residue:530
BDBM31757
NameBDBM31757
Synonyms:6-hydroxy-3a,4,5,9b-tetrahydro-3H-cyclopenta[c]quinoline-4-carboxylic acid MLS-0015717.0001 | cid_654089
TypeSmall organic molecule
Emp. Form.C13H13NO3
Mol. Mass.231.2472
SMILESOC(=O)C1Nc2c(O)cccc2C2C=CCC12