Reaction Details
TargetPC4 and SFRS1-interacting protein
LigandBDBM81264
Substrate/Competitorn/a
Meas. Tech.Counterscreen for inhibitors of LEDGF/p75-dependent integration: TR-FRET-based biochemical high throughput dose response counterscreen assay to identify activators of HIV-1 Integrase multimerization
IC50 1874±n/a nM
Citation PubChem, PC Counterscreen for inhibitors of LEDGF/p75-dependent integration: TR-FRET-based biochemical high throughput dose response counterscreen assay to identify activators of HIV-1 Integrase multimerization PubChem Bioassay(2014)[AID]
 
PC4 and SFRS1-interacting protein
Name:PC4 and SFRS1-interacting protein
Type:Enzyme Catalytic Domain
Mol. Mass.:60120.68
Organism:Homo sapiens (Human)
Description:gi_6708281
Residue:530
BDBM81264
NameBDBM81264
Synonyms:5-(2-aminoethyl)benzene-1,2,4-triol;hydrobromide 6-Hydroxydopamine hydrobromide MLS002207128 cid_176170
TypeSmall organic molecule
Emp. Form.C8H11NO3
Mol. Mass.169.1778
SMILESNCCc1cc(O)c(O)cc1O