Reaction Details
TargetPC4 and SFRS1-interacting protein
LigandBDBM83713
Substrate/Competitorn/a
Meas. Tech.Counterscreen for inhibitors of LEDGF/p75-dependent integration: TR-FRET-based biochemical high throughput dose response counterscreen assay to identify activators of HIV-1 Integrase multimerization
IC50 1449±n/a nM
Citation PubChem, PC Counterscreen for inhibitors of LEDGF/p75-dependent integration: TR-FRET-based biochemical high throughput dose response counterscreen assay to identify activators of HIV-1 Integrase multimerization PubChem Bioassay(2014)[AID]
 
PC4 and SFRS1-interacting protein
Name:PC4 and SFRS1-interacting protein
Type:Enzyme Catalytic Domain
Mol. Mass.:60120.68
Organism:Homo sapiens (Human)
Description:gi_6708281
Residue:530
BDBM83713
NameBDBM83713
Synonyms:7,11b-dihydro-6H-indeno[2,1-c][1]benzopyran-3,6a,9,10-tetrol Brasilin SMR001547554 | cid_222515
TypeSmall organic molecule
Emp. Form.C16H14O5
Mol. Mass.286.2794
SMILESOc1ccc2C3c4cc(O)c(O)cc4CC3(O)COc2c1