Reaction Details
TargetKinesin-like protein KIF11 [1-973]
LigandBDBM115177
Substrate/Competitorn/a
Meas. Tech.Microtubule-activated ATPase Kinetic Assay
IC50 1.72e+3±n/a nM
Citation Carbajales, CPrado, MÁGutirrez-de-Tern, HGutiérrez-de-Terán, AAzuaje, JNovio, SNuez, MJNuñez, BFernández-García, EGarca-Mera, XGarcía-Mera, PSánchez-Lazo, MCoelho, A Structure-based design of new KSP-Eg5 inhibitors assisted by a targeted multicomponent reaction. Chembiochem15:1471-80 (2014) 
 
Kinesin-like protein KIF11 [1-973]
Name:Kinesin-like protein KIF11 [1-973]
Type:Protein
Mol. Mass.:109974.43
Organism:Homo sapiens (Human)
Description:P52732[1-973]
Residue:973
BDBM115177
NameBDBM115177
Synonyms:(−)-Ethyl 2-[2-(2-benzoyl-5,6-dibromo-1H-benzo[d]imidazol-1-yl)pentanamido]acetate (Compound 23) | (+)-Ethyl 2-[2-(2-benzoyl-5,6-dibromo-1H-benzo[d]imidazol-1-yl)pentanamido] acetate (Compound 22)
TypeSmall organic molecule
Emp. Form.C23H23Br2N3O4
Mol. Mass.565.254
SMILESCCCC(C(=O)NCC(=O)OCC)n1c(nc2cc(Br)c(Br)cc12)C(=O)c1ccccc1