Reaction Details
TargetMacrophage colony-stimulating factor 1 receptor
LigandBDBM50443165
Substrate/Competitorn/a
Meas. Tech.Fluorescence Polarization Competition Assay
pH7.5±n/a
IC50 0.94±n/a nM
Commentsextracted
Citation Illig, CRBallentine, SKChen, JDesJariais, RLMeegalla, SKWall, MWilson, K Inhibitors of C-FMS kinase US Patent US8674100 Publication Date 3/18/2014
 
Macrophage colony-stimulating factor 1 receptor
Name:Macrophage colony-stimulating factor 1 receptor
Type:Protein
Mol. Mass.:109173.45
Organism:Mus musculus (Mouse)
Description:P09581
Residue:977
BDBM50443165
NameBDBM50443165
Synonyms:CHEMBL3085828 | US8674100, 22
TypeSmall organic molecule
Emp. Form.C26H33N5O2
Mol. Mass.447.5725
SMILESCC(C)(N1CCOCC1)c1ccc(NC(=O)c2ncc([nH]2)C#N)c(c1)C1=CCC(C)(C)CC1