Reaction Details
TargetMacrophage colony-stimulating factor 1 receptor
LigandBDBM50443140
Substrate/Competitorn/a
Meas. Tech.Fluorescence Polarization Competition Assay
pH7.5±n/a
IC50 0.75±n/a nM
Commentsextracted
Citation Illig, CRBallentine, SKChen, JDesJariais, RLMeegalla, SKWall, MWilson, K Inhibitors of C-FMS kinase US Patent US8674100 Publication Date 3/18/2014
 
Macrophage colony-stimulating factor 1 receptor
Name:Macrophage colony-stimulating factor 1 receptor
Type:Protein
Mol. Mass.:109173.45
Organism:Mus musculus (Mouse)
Description:P09581
Residue:977
BDBM50443140
NameBDBM50443140
Synonyms:CHEMBL3085984 | US8674100, 150
TypeSmall organic molecule
Emp. Form.C26H34N6O2
Mol. Mass.462.5872
SMILESCC1(C)CCC(=CC1)c1cc(CN2CCN(CCO)CC2)ccc1NC(=O)c1ncc([nH]1)C#N