Reaction Details
TargetTrifunctional purine biosynthetic protein adenosine-3
LigandBDBM24685
Substrate/Competitorn/a
Meas. Tech.Enzyme Activity Assays
Ki 1.8e+2±n/a nM
Citation Connelly, SDeMartino, JKBoger, DLWilson, IA Biological and structural evaluation of 10R- and 10S-methylthio-DDACTHF reveals a new role for sulfur in inhibition of glycinamide ribonucleotide transformylase. Biochemistry52:5133-44 (2013) 
 
Trifunctional purine biosynthetic protein adenosine-3
Name:Trifunctional purine biosynthetic protein adenosine-3
Type:Protein
Mol. Mass.:107768.47
Organism:Homo sapiens (Human)
Description:P22102
Residue:1010
BDBM24685
NameBDBM24685
Synonyms:10-thiomethyl-DDACTHF, 10R-3 2-({4-[(1R)-4-(2,4-diamino-6-oxo-1,6-dihydropyrimidin-5-yl)-1-(methylsulfanyl)butyl]phenyl}formamido)pentanedioic acid
TypeSmall organic molecule
Emp. Form.C21H27N5O6S
Mol. Mass.477.534
SMILESCS[C@H](CCCc1c(N)nc(N)[nH]c1=O)c1ccc(cc1)C(=O)NC(CCC(O)=O)C(O)=O