Reaction Details
TargetTrace amine-associated receptor 1
LigandBDBM119193
Substrate/Competitorn/a
Meas. Tech.Radioligand Binding Assay
Ki 0.3±n/a nM
Citation Nettekoven, MNorcross, RPolara, A Dihydrooxazol-2-amine derivatives US Patent US8673950 Publication Date 3/18/2014
 
Trace amine-associated receptor 1
Name:Trace amine-associated receptor 1
Type:Protein
Mol. Mass.:37635.41
Organism:Mus musculus (Mouse)
Description:Q923Y8
Residue:332
BDBM119193
NameBDBM119193
Synonyms:US8673950, 60
TypeSmall organic molecule
Emp. Form.C19H23N5O
Mol. Mass.337.4188
SMILESNC1=N[C@@H](CCc2ccc(Nc3ncc(cn3)C3CCC3)cc2)CO1