Reaction Details
TargetcGMP-dependent 3',5'-cyclic phosphodiesterase
LigandBDBM119680
Substrate/Competitorn/a
Meas. Tech.Inhibition Assay
Ki 73±n/a nM
Citation DeLeon, PEgbertson, MHills, IDJohnson, AWMachacek, M Quinolinone PDE2 inhibitors US Patent US8680116 Publication Date 3/25/2014
 
cGMP-dependent 3',5'-cyclic phosphodiesterase
Name:cGMP-dependent 3',5'-cyclic phosphodiesterase
Type:Enzyme Catalytic Domain
Mol. Mass.:105691.58
Organism:Homo sapiens (Human)
Description:O00408
Residue:941
BDBM119680
NameBDBM119680
Synonyms:US8680116, 1-13
TypeSmall organic molecule
Emp. Form.C20H21BrN2O2S
Mol. Mass.433.362
SMILESCN1CCC(COc2c(-c3cccs3)c(=O)[nH]c3ccc(Br)cc23)CC1