Reaction Details
TargetcGMP-dependent 3',5'-cyclic phosphodiesterase
LigandBDBM50444037
Substrate/Competitorn/a
Meas. Tech.Inhibition Assay
Ki 1.3±n/a nM
Citation DeLeon, PEgbertson, MHills, IDJohnson, AWMachacek, M Quinolinone PDE2 inhibitors US Patent US8680116 Publication Date 3/25/2014
 
cGMP-dependent 3',5'-cyclic phosphodiesterase
Name:cGMP-dependent 3',5'-cyclic phosphodiesterase
Type:Enzyme Catalytic Domain
Mol. Mass.:105691.58
Organism:Homo sapiens (Human)
Description:O00408
Residue:941
BDBM50444037
NameBDBM50444037
Synonyms:CHEMBL3092564 | US8680116, 1-15
TypeSmall organic molecule
Emp. Form.C26H23N3O2S
Mol. Mass.441.545
SMILESO=c1[nH]c2ccc(cc2c(OCC2CCNCC2)c1-c1cccs1)C#Cc1cccnc1