Reaction Details
TargetcGMP-dependent 3',5'-cyclic phosphodiesterase
LigandBDBM119681
Substrate/Competitorn/a
Meas. Tech.Inhibition Assay
Ki 200±n/a nM
Citation DeLeon, PEgbertson, MHills, IDJohnson, AWMachacek, M Quinolinone PDE2 inhibitors US Patent US8680116 Publication Date 3/25/2014
 
cGMP-dependent 3',5'-cyclic phosphodiesterase
Name:cGMP-dependent 3',5'-cyclic phosphodiesterase
Type:Enzyme Catalytic Domain
Mol. Mass.:105691.58
Organism:Homo sapiens (Human)
Description:O00408
Residue:941
BDBM119681
NameBDBM119681
Synonyms:US8680116, 1-18
TypeSmall organic molecule
Emp. Form.C27H18N2O2S
Mol. Mass.434.509
SMILESCOc1cc2[nH]c(=O)c(-c3cccs3)c(-c3cccc(c3)C#N)c2cc1-c1ccccc1