Reaction Details
TargetcGMP-dependent 3',5'-cyclic phosphodiesterase
LigandBDBM119682
Substrate/Competitorn/a
Meas. Tech.Inhibition Assay
Ki 62±n/a nM
Citation DeLeon, PEgbertson, MHills, IDJohnson, AWMachacek, M Quinolinone PDE2 inhibitors US Patent US8680116 Publication Date 3/25/2014
 
cGMP-dependent 3',5'-cyclic phosphodiesterase
Name:cGMP-dependent 3',5'-cyclic phosphodiesterase
Type:Enzyme Catalytic Domain
Mol. Mass.:105691.58
Organism:Homo sapiens (Human)
Description:O00408
Residue:941
BDBM119682
NameBDBM119682
Synonyms:US8680116, 1-23
TypeSmall organic molecule
Emp. Form.C27H25N3O2S
Mol. Mass.455.571
SMILESCN1CCC(COc2c(-c3cccs3)c(=O)[nH]c3ccc(cc23)C#Cc2cccnc2)CC1