Reaction Details
TargetcGMP-dependent 3',5'-cyclic phosphodiesterase
LigandBDBM119683
Substrate/Competitorn/a
Meas. Tech.Inhibition Assay
Ki 160±n/a nM
Citation DeLeon, PEgbertson, MHills, IDJohnson, AWMachacek, M Quinolinone PDE2 inhibitors US Patent US8680116 Publication Date 3/25/2014
 
cGMP-dependent 3',5'-cyclic phosphodiesterase
Name:cGMP-dependent 3',5'-cyclic phosphodiesterase
Type:Enzyme Catalytic Domain
Mol. Mass.:105691.58
Organism:Homo sapiens (Human)
Description:O00408
Residue:941
BDBM119683
NameBDBM119683
Synonyms:US8680116, 1-48
TypeSmall organic molecule
Emp. Form.C24H17N3O2S
Mol. Mass.411.476
SMILESO=c1[nH]c2ccc(cc2c(OCc2ccccn2)c1-c1cccs1)-c1ccncc1