Reaction Details
TargetcGMP-dependent 3',5'-cyclic phosphodiesterase
LigandBDBM119684
Substrate/Competitorn/a
Meas. Tech.Inhibition Assay
Ki 900±n/a nM
Citation DeLeon, PEgbertson, MHills, IDJohnson, AWMachacek, M Quinolinone PDE2 inhibitors US Patent US8680116 Publication Date 3/25/2014
 
cGMP-dependent 3',5'-cyclic phosphodiesterase
Name:cGMP-dependent 3',5'-cyclic phosphodiesterase
Type:Enzyme Catalytic Domain
Mol. Mass.:105691.58
Organism:Homo sapiens (Human)
Description:O00408
Residue:941
BDBM119684
NameBDBM119684
Synonyms:US8680116, 1-51
TypeSmall organic molecule
Emp. Form.C20H13BrN2OS
Mol. Mass.409.299
SMILESBrc1ccc2[nH]c(=O)c(-c3cccs3)c(\C=C\c3ccccn3)c2c1