Reaction Details
TargetcGMP-dependent 3',5'-cyclic phosphodiesterase
LigandBDBM119686
Substrate/Competitorn/a
Meas. Tech.Inhibition Assay
Ki 34±n/a nM
Citation DeLeon, PEgbertson, MHills, IDJohnson, AWMachacek, M Quinolinone PDE2 inhibitors US Patent US8680116 Publication Date 3/25/2014
 
cGMP-dependent 3',5'-cyclic phosphodiesterase
Name:cGMP-dependent 3',5'-cyclic phosphodiesterase
Type:Enzyme Catalytic Domain
Mol. Mass.:105691.58
Organism:Homo sapiens (Human)
Description:O00408
Residue:941
BDBM119686
NameBDBM119686
Synonyms:US8680116, 1-63
TypeSmall organic molecule
Emp. Form.C26H20N2O3S
Mol. Mass.440.514
SMILESCOc1cc2[nH]c(=O)c(-c3cccs3)c(-c3cccc(c3)-c3ccccn3)c2cc1OC