Reaction Details
TargetHistone deacetylase 6
LigandBDBM119440
Substrate/Competitorn/a
Meas. Tech.Enzyme Assay
Temperature303.15±n/a K
IC50 0.7±n/a nM
Commentsextracted
Citation Cossío Mora, FPZubia Olascoaga, AVara Salazar, YSan Sebastián Larzabal, EIOtaegui Ansa, DMasdeu Margalef, MAldaba Arévalo, E Histone deacetylase inhibitors based simultaneously on trisubstituted 1H-pyrroles and aromatic and heteroaromatic spacers US Patent US8685992 Publication Date 4/1/2014
 
Histone deacetylase 6
Name:Histone deacetylase 6
Type:Chromatin regulator; hydrolase; repressor
Mol. Mass.:131381.51
Organism:Homo sapiens (Human)
Description:Q9UBN7
Residue:1215
BDBM119440
NameBDBM119440
Synonyms:BDBM119696 | US8685986, 15
TypeSmall organic molecule
Emp. Form.C23H19N3O5
Mol. Mass.417.4141
SMILESONC(=O)c1ccc(CNC(=O)c2[nH]c(cc2-c2ccoc2)-c2ccc(O)cc2)cc1