Reaction Details
TargetHistone deacetylase 7
LigandBDBM119440
Substrate/Competitorn/a
Meas. Tech.Enzyme Assay
Temperature303.15±n/a K
IC50 178±n/a nM
Commentsextracted
Citation Cossío Mora, FPZubia Olascoaga, AVara Salazar, YSan Sebastián Larzabal, EIOtaegui Ansa, DMasdeu Margalef, MAldaba Arévalo, E Histone deacetylase inhibitors based simultaneously on trisubstituted 1H-pyrroles and aromatic and heteroaromatic spacers US Patent US8685992 Publication Date 4/1/2014
 
Histone deacetylase 7
Name:Histone deacetylase 7
Type:Chromatin regulator; hydrolase; repressor
Mol. Mass.:102942.62
Organism:Homo sapiens (Human)
Description:Q8WUI4
Residue:952
BDBM119440
NameBDBM119440
Synonyms:BDBM119696 | US8685986, 15
TypeSmall organic molecule
Emp. Form.C23H19N3O5
Mol. Mass.417.4141
SMILESONC(=O)c1ccc(CNC(=O)c2[nH]c(cc2-c2ccoc2)-c2ccc(O)cc2)cc1