Reaction Details
TargetArachidonate 5-lipoxygenase-activating protein
LigandBDBM283140
Substrate/Competitorn/a
Meas. Tech.Binding Assay
Ki 1.000±n/a nM
Citation Bacani, GMEccles, WFitzgerald, AEGoldberg, SDHack, MDHawryluk, NAJones, WMKeith, JMKrawczuk, PLebsack, ADLee-Dutra, ALiu, JMcClure, KJMeduna, SPPippel, DJRosen, MDSales, ZS FLAP modulators US Patent US9884878 Publication Date 2/6/2018
 
Arachidonate 5-lipoxygenase-activating protein
Name:Arachidonate 5-lipoxygenase-activating protein
Type:Enzyme
Mol. Mass.:18159.90
Organism:Homo sapiens (Human)
Description:P20292
Residue:161
BDBM283140
NameBDBM283140
Synonyms:4'-(5-Aminopyrazin-2-yl)-3'-fluoro-N-(2,2,2- trifluoro-1,1-dimethylethyl)biphenyl-2- sulfonamide | US9884878, Compound 13
TypeSmall organic molecule
Emp. Form.C21H19F4N3O2S
Mol. Mass.453.453
SMILESCC(C)(CS(=O)(=O)c1ccccc1-c1ccc(c(F)c1)-c1cnc(N)cn1)C(F)(F)F