Reaction Details
TargetArachidonate 5-lipoxygenase-activating protein
LigandBDBM60470
Substrate/Competitorn/a
Meas. Tech.Binding Assay
Ki 1.000±n/a nM
Citation Bacani, GMEccles, WFitzgerald, AEGoldberg, SDHack, MDHawryluk, NAJones, WMKeith, JMKrawczuk, PLebsack, ADLee-Dutra, ALiu, JMcClure, KJMeduna, SPPippel, DJRosen, MDSales, ZS FLAP modulators US Patent US9884878 Publication Date 2/6/2018
 
Arachidonate 5-lipoxygenase-activating protein
Name:Arachidonate 5-lipoxygenase-activating protein
Type:Enzyme
Mol. Mass.:18159.90
Organism:Homo sapiens (Human)
Description:P20292
Residue:161
BDBM60470
NameBDBM60470
Synonyms:BDBM168646 US9745328, Compound 127 | US9884878, Compound 127
Typen/a
Emp. Form.C19H16F4N4O2S
Mol. Mass.440.415
SMILESC[C@@H](NS(=O)(=O)c1ccccc1-c1ccc(c(F)c1)-c1cnc(N)cn1)C(F)(F)F