Reaction Details
TargetArachidonate 5-lipoxygenase-activating protein
LigandBDBM168991
Substrate/Competitorn/a
Meas. Tech.Binding Assay
Ki 1.000±n/a nM
Citation Bacani, GMEccles, WFitzgerald, AEGoldberg, SDHack, MDHawryluk, NAJones, WMKeith, JMKrawczuk, PLebsack, ADLee-Dutra, ALiu, JMcClure, KJMeduna, SPPippel, DJRosen, MDSales, ZS FLAP modulators US Patent US9884878 Publication Date 2/6/2018
 
Arachidonate 5-lipoxygenase-activating protein
Name:Arachidonate 5-lipoxygenase-activating protein
Type:Enzyme
Mol. Mass.:18159.90
Organism:Homo sapiens (Human)
Description:P20292
Residue:161
BDBM168991
NameBDBM168991
Synonyms:US9079866, 392 US9884878, Compound 392
TypeSmall organic molecule
Emp. Form.C23H22FN3O5S2
Mol. Mass.503.566
SMILESFc1cc(ccc1-c1cnc2NCCOc2c1)-c1ccccc1S(=O)(=O)N1CCS(=O)(=O)CC1