Reaction Details
TargetArachidonate 5-lipoxygenase-activating protein
LigandBDBM169033
Substrate/Competitorn/a
Meas. Tech.Binding Assay
Ki 1.000±n/a nM
Citation Bacani, GMEccles, WFitzgerald, AEGoldberg, SDHack, MDHawryluk, NAJones, WMKeith, JMKrawczuk, PLebsack, ADLee-Dutra, ALiu, JMcClure, KJMeduna, SPPippel, DJRosen, MDSales, ZS FLAP modulators US Patent US9884878 Publication Date 2/6/2018
 
Arachidonate 5-lipoxygenase-activating protein
Name:Arachidonate 5-lipoxygenase-activating protein
Type:Enzyme
Mol. Mass.:18159.90
Organism:Homo sapiens (Human)
Description:P20292
Residue:161
BDBM169033
NameBDBM169033
Synonyms:US9079866, 434 US9884878, Compound 434
TypeSmall organic molecule
Emp. Form.C21H20FN5O2S
Mol. Mass.425.479
SMILESCC(C)(C)NS(=O)(=O)c1ccccc1-c1ccc(c(F)c1)-c1cnc(N)c(n1)C#N