Reaction Details
TargetArachidonate 5-lipoxygenase-activating protein
LigandBDBM169044
Substrate/Competitorn/a
Meas. Tech.Binding Assay
Ki 1.000±n/a nM
Citation Bacani, GMEccles, WFitzgerald, AEGoldberg, SDHack, MDHawryluk, NAJones, WMKeith, JMKrawczuk, PLebsack, ADLee-Dutra, ALiu, JMcClure, KJMeduna, SPPippel, DJRosen, MDSales, ZS FLAP modulators US Patent US9884878 Publication Date 2/6/2018
 
Arachidonate 5-lipoxygenase-activating protein
Name:Arachidonate 5-lipoxygenase-activating protein
Type:Enzyme
Mol. Mass.:18159.90
Organism:Homo sapiens (Human)
Description:P20292
Residue:161
BDBM169044
NameBDBM169044
Synonyms:US9079866, 445 US9884878, Compound 445
TypeSmall organic molecule
Emp. Form.C21H23FN4O2S
Mol. Mass.414.496
SMILESCc1nc(cnc1N)-c1ccc(cc1F)-c1ccccc1S(=O)(=O)NC(C)(C)C